{"text_format":"3","workbook":"xlsx","n_sheets":4,"sheets":["Key data","Financing budget","Forwarding of funds","Example"],"not_rendered":{"defined_names":7},"read":"whole","date_system":"1900"}

{"sheet":"Key data","index":0,"n_rows":22,"n_cols":10,"rows_kept":22,"merged":[[0,1,0,6],[0,9,0,14],[2,2,2,6],[4,2,4,4],[5,2,5,6],[6,4,6,6],[7,4,7,6],[15,3,15,6],[16,3,16,6],[17,3,17,6],[18,3,18,6],[19,2,19,6],[21,2,21,6]]}
[null,"Key data",{"$nulls":7},"Instructions for the financing recipient:\nPlease start by entering the key data before proceeding to the ‘Financing budget” tab.\nPlease only enter information in the blue cells. All other cells will be calculated automatically."]
[]
[null,"Name of the recipient: ",{"$nulls":5},{"$f":"IF(C3=\"Bitte eintragen\",\"- Bitte den Namen Ihres Vereins im Feld <Name des Zuschussempfängers> eintragen; \",\" \")","v":" "}]
[]
[null,"Is this the first budget \nor is an existing contract being modified?","Select",null,null,{"$f":"IF(C5=\"Modification to a contract\",\"How many times has the contract been modified?:\",\"\")","v":""},"Only select for modifications to a contract",{"$f":"IF(C5=\"Vertragsanpassung\",1,0)","v":0}]
[null,"Project title",{"$nulls":5},{"$f":"IF(C6=\"Veranstaltung\",1,IF(C6=\"Projekt\",1,0))","v":0}]
[null,"Do you require administration costs?","Select","Please enter the administration costs as a percentage ",{"$nulls":3},{"$f":"IF(C7=\"Ja, anderer Betrag\",1,0)","v":0}]
[null,"Are you providing a (financial) contribution of your own?","Select","Amount in EUR",{"$nulls":3},{"$f":"IF(C8=\"Ja, anderer Betrag\",1,0)","v":0}]
[null,"How many donors will be co-financing the project (in addition to GIZ)?","Select","Name of the provider of third-party funding",null,"Amount of third-party funding in EUR"]
[{"$nulls":3},"Name of the provider of third-party funding",null,"Amount of third-party funding in EUR",null,{"$f":"IF(C10=\"Ja\",1,0)","v":0}]
[{"$nulls":3},"Name of the provider of third-party funding",null,"Amount of third-party funding in EUR",null,{"$f":"IF(C11=\"Ja\",1,0)","v":0}]
[{"$nulls":3},"Name of the provider of third-party funding",null,"Amount of third-party funding in EUR"]
[{"$nulls":3},"Name of the provider of third-party funding",null,"Amount of third-party funding in EUR"]
[{"$nulls":3},"Name of the provider of third-party funding",null,"Amount of third-party funding in EUR"]
[{"$nulls":3},"Name of the provider of third-party funding",null,"Amount of third-party funding in EUR"]
[null,"Will funds be forwarded to third-party recipients? (Please note, this does not relate to services) ","Select","This refers to third-party recipients that independently implement part of the recipient's project. A separate budget must be submitted and a commercial and legal eligibility check carried out by the GIZ project (needed criteria: legal entity and public-benefit nature). "]
[null,"Will medicines and/or pesticides and mineral fertilizers be procured?  ","Select","A separate internal GIZ approval process is needed."]
[null,"Will materials and equipment worth more than EUR 1,000,000 be procured or is more than 50% of the contract value earmarked for the procurement of materials and equipment for a contract worth at least EUR 400,000?","Select","A separate internal GIZ approval process is needed"]
[null,"Are construction measures being financed?  ","Select","A separate internal GIZ approval process is needed."]
[null,"Are tooltips to be displayed in the budget? \n‘Yes’ recommended for filling out the form\n‘No’ recommended for a better overview","Select"]
[]
[null,"Date of budget finalisation:"]

{"sheet":"Financing budget","index":1,"n_rows":172,"n_cols":15,"rows_kept":172,"merged":[[0,0,0,8],[0,14,0,23],[2,14,2,23],[3,1,3,7],[3,8,3,9],[4,3,4,7],[4,9,142,9],[42,3,42,7],[43,4,43,6],[44,4,44,6],[45,4,45,6],[46,4,46,6],[47,4,47,6],[48,4,48,6],[49,4,49,6],[50,4,50,6],[51,4,51,6],[52,4,52,6],[53,4,53,6],[54,4,54,6],[55,4,55,6],[56,4,56,6],[57,4,57,6],[58,4,58,6],[59,4,59,6],[60,4,60,6],[61,4,61,6],[62,4,62,6],[63,4,63,6],[64,4,64,6],[65,4,65,6],[66,4,66,6],[67,4,67,6],[68,4,68,6],[69,4,69,6],[70,4,70,6],[71,4,71,6],[72,3,72,7],[73,4,73,6],[74,4,74,6],[75,4,75,6],[76,4,76,6],[77,4,77,6],[78,4,78,6],[79,4,79,6],[80,4,80,6],[81,4,81,6],[82,4,82,6],[83,4,83,6],[84,4,84,6],[85,4,85,6],[86,4,86,6],[87,4,87,6],[88,4,88,6],[89,4,89,6],[90,4,90,6],[91,3,91,7],[92,4,92,6],[93,4,93,6],[94,4,94,6],[95,4,95,6],[96,4,96,6],[97,4,97,6],[98,4,98,6],[99,4,99,6],[100,4,100,6],[101,4,101,6],[102,4,102,6],[103,4,103,6],[104,4,104,6],[105,4,105,6],[106,4,106,6],[107,4,107,6],[108,3,108,7],[109,4,109,6],[110,4,110,6],[111,4,111,6],[112,4,112,6],[113,4,113,6],[114,4,114,6],[115,4,115,6],[116,4,116,6],[117,4,117,6],[118,4,118,6],[119,4,119,6],[120,4,120,6],[121,4,121,6],[122,4,122,6],[123,4,123,6],[124,4,124,6],[125,3,125,7],[136,3,136,7],[142,1,142,7],[143,3,143,7],[146,3,146,7],[154,3,154,7],[163,1,163,7],[163,8,163,9],[165,1,165,10],[167,1,167,9],[168,1,168,9],[169,1,169,9],[171,1,171,9]]}
[{"$f":"IF('Key data'!C3=\"\",\"Please fill out the 'Key data' tab first (see below)\",CONCATENATE(\"Estimated Budget - Annex 1\",CHAR(10),'Key data'!C3,\" - \",'Key data'!C6,\"\",'Key data'!E6,\"\",IF(L4=\"VE\",CONCATENATE(\" - \",'Key data'!G5,\"SUPPLEMENT TO THE CONTRACT\",\"\"),\"\")))","v":"Please fill out the 'Key data' tab first (see below)"},{"$nulls":8},{"$f":"'Key data'!C22","v":"00:00:00"},{"$nulls":3},"no change","Instructions:\nPlease fill out the key data sheet before proceeding to the 'Financing budget’ tab.\nOn this ‘Financing budget’ tab, please only enter information in the blue cells. All other cells will be calculated automatically."]
[{"$nulls":13},"change"]
[null,"Description","Code","Quantity ","Unit (e.g. person, vehicle, room)","Quantity","Unit (e.g. months, days, courses)","Eligible for support up to  \nin EUR \n(price per unit) ","Total \nGIZ funding\nin EUR (up to)","Own contributions/third-party financing\nin EUR (up to) ",null,{"$f":"IF($L$4=\"VE\",CONCATENATE(\"For contract modifications:\",CHAR(10),\"Has this budget line changed?\"),\"\")","v":""},null,null,"General information: \nThis budget format is used as a basis for settlement. You may create additional files with more detailed information for your own internal use.\nAll items listed in the budget must be included in the project description to ensure that the project reference is clear. \nThe table contains formulas that must be retained.  \nPlease keep the two-decimal-place format. \nWe advise rounding up units to the nearest full unit. Costs are agreed at a value of ‘up to’. "]
[null,{"$f":"IF('Key data'!C20=\"yes\",CONCATENATE(\"Note: Blue fields to be filled in by \",IF('Key data'!C3=\"\",\"the recipient\",'Key data'!C3)),\"\")","v":""},{"$nulls":6},{"$f":"IF('Key data'!C20=\"yes\",\" Note: calculated automatically\",\"\")","v":""},null,null,{"$f":"IF('Key data'!C5=\"Modification to a contract\",\"VE\",\"NOVE\")","v":"NOVE"}]
[1,"Staff - prime cost for employees of the Recipient (job title)\n(Note 1: Only staff from your organisation; the evidence for this budget line must be provided in the form of payslips or, in the case of partial financing, in the form of payslips and time sheets.\nNote 2: Only direct costs for staff (gross cost for the employer) may be settled. Add-ons such as staff overheads that are calculated pro-rata for staff are not eligible for support)",null,{"$f":"IF('Key data'!C20=\"yes\",CONCATENATE(\"Tooltip:\",Example!O5),\"\")","v":""},{"$nulls":4},{"$f":"SUM(I6:I42)","v":{"v":0,"d":"0.00"}},"GIZ is unable to provide pro-rata financing for any of the budget lines (with the exception of staff costs (item 1) which can be covered on a percentage basis, or costs that fall under the cost category ‘Pro-rata local project costs’ (item 7)). \n\nCosts that are incurred as part of the implementation of the project but are not funded by GIZ are calculated separately - either as own contribution or, if applicable, as financial contribution of a third party.",null,{"$f":"IF(L4=\"VE\",\"PLEASE NOTE: GIZ cannot cover any costs that arise as a result of currency fluctuations.\",\"\")","v":""}]
[{"$nulls":4},"people",null,"months",null,{"$f":"ROUND(D6*F6*H6,2)","v":{"v":0,"d":"0.00"}},null,null,"No change"]
[{"$nulls":4},"people",null,"months",null,{"$f":"ROUND(D7*F7*H7,2)","v":{"v":0,"d":"0.00"}},null,null,"No change"]
[{"$nulls":4},"people",null,"months",null,{"v":0,"d":"0.00"},null,null,"No change"]
[{"$nulls":4},"people",null,"months",null,{"v":0,"d":"0.00"},null,null,"No change"]
[{"$nulls":4},"people",null,"months",null,{"v":0,"d":"0.00"},null,null,"No change"]
[{"$nulls":4},"people",null,"months",null,{"v":0,"d":"0.00"},null,null,"No change"]
[{"$nulls":4},"people",null,"months",null,{"v":0,"d":"0.00"},null,null,"No change"]
[{"$nulls":4},"people",null,"months",null,{"v":0,"d":"0.00"},null,null,"No change"]
[{"$nulls":4},"people",null,"months",null,{"$f":"ROUND(D14*F14*H14,2)","v":{"v":0,"d":"0.00"}},null,null,"No change"]
[{"$nulls":4},"people",null,"months",null,{"v":0,"d":"0.00"},null,null,"No change"]
[{"$nulls":4},"people",null,"months",null,{"v":0,"d":"0.00"},null,null,"No change"]
[{"$nulls":4},"people",null,"months",null,{"v":0,"d":"0.00"},null,null,"No change"]
[{"$nulls":4},"people",null,"months",null,{"v":0,"d":"0.00"},null,null,"No change"]
[{"$nulls":4},"people",null,"months",null,{"v":0,"d":"0.00"},null,null,"No change"]
[{"$nulls":4},"people",null,"months",null,{"v":0,"d":"0.00"},null,null,"No change"]
[{"$nulls":4},"people",null,"months",null,{"v":0,"d":"0.00"},null,null,"No change"]
[{"$nulls":4},"people",null,"months",null,{"v":0,"d":"0.00"},null,null,"No change"]
[{"$nulls":4},"people",null,"months",null,{"v":0,"d":"0.00"},null,null,"No change"]
[{"$nulls":4},"people",null,"months",null,{"v":0,"d":"0.00"},null,null,"No change"]
[{"$nulls":4},"people",null,"months",null,{"v":0,"d":"0.00"},null,null,"No change"]
[{"$nulls":4},"people",null,"months",null,{"v":0,"d":"0.00"},null,null,"No change"]
[{"$nulls":4},"people",null,"months",null,{"v":0,"d":"0.00"},null,null,"No change"]
[{"$nulls":4},"people",null,"months",null,{"v":0,"d":"0.00"},null,null,"No change"]
[{"$nulls":4},"people",null,"months",null,{"v":0,"d":"0.00"},null,null,"No change"]
[{"$nulls":4},"people",null,"months",null,{"v":0,"d":"0.00"},null,null,"No change"]
{"$rows_left_out":143}
{"sheet":"Forwarding of funds","index":2,"n_rows":155,"n_cols":14,"rows_kept":155,"merged":[[0,3,0,8],[3,1,3,7],[3,8,3,9],[4,3,4,7],[4,9,142,9],[42,3,42,7],[43,4,43,6],[44,4,44,6],[45,4,45,6],[46,4,46,6],[47,4,47,6],[48,4,48,6],[49,4,49,6],[50,4,50,6],[51,4,51,6],[52,4,52,6],[53,4,53,6],[54,4,54,6],[55,4,55,6],[56,4,56,6],[57,4,57,6],[58,4,58,6],[59,4,59,6],[60,4,60,6],[61,4,61,6],[62,4,62,6],[63,4,63,6],[64,4,64,6],[65,4,65,6],[66,4,66,6],[67,4,67,6],[68,4,68,6],[69,4,69,6],[70,4,70,6],[71,4,71,6],[72,3,72,7],[73,4,73,6],[74,4,74,6],[75,4,75,6],[76,4,76,6],[77,4,77,6],[78,4,78,6],[79,4,79,6],[80,4,80,6],[81,4,81,6],[82,4,82,6],[83,4,83,6],[84,4,84,6],[85,4,85,6],[86,4,86,6],[87,4,87,6],[88,4,88,6],[89,4,89,6],[90,4,90,6],[91,3,91,7],[92,4,92,6],[93,4,93,6],[94,4,94,6],[95,4,95,6],[96,4,96,6],[97,4,97,6],[98,4,98,6],[99,4,99,6],[100,4,100,6],[101,4,101,6],[102,4,102,6],[103,4,103,6],[104,4,104,6],[105,4,105,6],[106,4,106,6],[107,4,107,6],[108,3,108,7],[125,3,125,7],[136,3,136,7],[143,3,143,7],[148,1,148,9],[150,1,150,9],[151,1,151,9],[152,1,152,9],[154,1,154,9]]}
[null,"Estimated Budget- Annex 1",null,"Name of the third-party recipient: ",{"$nulls":5},{"$f":"'Key data'!C22","v":"00:00:00"},{"$nulls":3},"no change"]
[{"$nulls":13},"change"]
[null,"Description","Code","Quantity","Unit (e.g. person, vehicle, room)","Quantity","Unit (e.g. months, days, courses)","Eligible for support up to  \nin EUR \n(price per unit) ","Total \nGIZ funding\nin EUR (up to)","Own contributions/third-party financing\nin EUR (up to) ",null,{"$f":"IF($L$4=\"VE\",CONCATENATE(\"For contract modifications:\",CHAR(10),\"Has this budget line changed?\"),\"\")","v":""}]
[null,{"$f":"IF('Key data'!C20=\"yes\",\"Note: Blue fields to be filled in by the third-party recipient\",\"\")","v":""},{"$nulls":6},{"$f":"IF('Key data'!C20=\"yes\",\" Note: calculated automatically\",\"\")","v":""},null,null,{"$f":"IF('Key data'!C5=\"Modification to a contract\",\"VE\",\"NOVE\")","v":"NOVE"}]
[1,"Staff - prime cost for employees of the Recipient (job title)\n(Note 1: Only staff from your organisations; the evidence for this budget line must be provided in the form of payslips or, in the case of partial financing, in the form of payslips and time sheets.\nNote 2: Only direct costs for staff (gross cost for the employer) may be settled. Add-ons such as staff overheads that are calculated pro-rata for staff are not eligible for support)",null,{"$f":"IF('Key data'!C20=\"yes\",CONCATENATE(\"Tooltip:\",Example!O5),\"\")","v":""},{"$nulls":4},{"$f":"SUM(I6:I42)","v":{"v":0,"d":"0.00"}},"GIZ is unable to provide pro-rata financing for any of the budget lines (with the exception of staff costs (item 1) which can be covered on a percentage basis, or costs that fall under the cost category ‘Pro-rata local project costs’ (item 7)). \n\nCosts that are incurred as part of the implementation of the project but are not funded by GIZ are calculated separately - either as own contribution or, if applicable, as financial contribution of a third party.",null,{"$f":"IF(L4=\"VE\",\"PLEASE NOTE: GIZ cannot cover any costs that arise as a result of currency fluctuations.\",\"\")","v":""}]
[{"$nulls":4},"people",null,"months",null,{"$f":"ROUND(D6*F6*H6,2)","v":{"v":0,"d":"0.00"}},null,null,"No change"]
[{"$nulls":4},"people",null,"months",null,{"$f":"ROUND(D7*F7*H7,2)","v":{"v":0,"d":"0.00"}},null,null,"No change"]
[{"$nulls":4},"people",null,"months",null,{"v":0,"d":"0.00"},null,null,"No change"]
[{"$nulls":4},"people",null,"months",null,{"v":0,"d":"0.00"},null,null,"No change"]
[{"$nulls":4},"people",null,"months",null,{"$f":"ROUND(D10*F10*H10,2)","v":{"v":0,"d":"0.00"}},null,null,"No change"]
[{"$nulls":4},"people",null,"months",null,{"v":0,"d":"0.00"},null,null,"No change"]
[{"$nulls":4},"people",null,"months",null,{"v":0,"d":"0.00"},null,null,"No change"]
[{"$nulls":4},"people",null,"months",null,{"v":0,"d":"0.00"},null,null,"No change"]
[{"$nulls":4},"people",null,"months",null,{"v":0,"d":"0.00"},null,null,"No change"]
[{"$nulls":4},"people",null,"months",null,{"v":0,"d":"0.00"},null,null,"No change"]
[{"$nulls":4},"people",null,"months",null,{"v":0,"d":"0.00"},null,null,"No change"]
[{"$nulls":4},"people",null,"months",null,{"v":0,"d":"0.00"},null,null,"No change"]
[{"$nulls":4},"people",null,"months",null,{"v":0,"d":"0.00"},null,null,"No change"]
[{"$nulls":4},"people",null,"months",null,{"v":0,"d":"0.00"},null,null,"No change"]
[{"$nulls":4},"people",null,"months",null,{"$f":"ROUND(D20*F20*H20,2)","v":{"v":0,"d":"0.00"}},null,null,"No change"]
[{"$nulls":4},"people",null,"months",null,{"v":0,"d":"0.00"},null,null,"No change"]
[{"$nulls":4},"people",null,"months",null,{"v":0,"d":"0.00"},null,null,"No change"]
[{"$nulls":4},"people",null,"months",null,{"v":0,"d":"0.00"},null,null,"No change"]
[{"$nulls":4},"people",null,"months",null,{"v":0,"d":"0.00"},null,null,"No change"]
[{"$nulls":4},"people",null,"months",null,{"v":0,"d":"0.00"},null,null,"No change"]
[{"$nulls":4},"people",null,"months",null,{"v":0,"d":"0.00"},null,null,"No change"]
[{"$nulls":4},"people",null,"months",null,{"v":0,"d":"0.00"},null,null,"No change"]
[{"$nulls":4},"people",null,"months",null,{"v":0,"d":"0.00"},null,null,"No change"]
[{"$nulls":4},"people",null,"months",null,{"v":0,"d":"0.00"},null,null,"No change"]
[{"$nulls":4},"people",null,"months",null,{"v":0,"d":"0.00"},null,null,"No change"]
{"$rows_left_out":126}
{"sheet":"Example","index":3,"n_rows":88,"n_cols":15,"rows_kept":88,"merged":[[0,0,0,8],[3,1,3,7],[3,8,3,9],[4,3,4,7],[4,9,63,9],[4,14,8,14],[10,3,10,7],[10,14,19,14],[11,4,11,6],[12,4,12,6],[13,4,13,6],[14,4,14,6],[15,4,15,6],[16,4,16,6],[17,4,17,6],[18,4,18,6],[19,4,19,6],[20,4,20,6],[21,3,21,7],[21,14,28,14],[22,4,22,6],[23,4,23,6],[24,4,24,6],[25,4,25,6],[26,4,26,6],[27,4,27,6],[28,4,28,6],[29,4,29,6],[30,4,30,6],[31,4,31,6],[32,4,32,6],[33,3,33,7],[33,14,42,14],[34,4,34,6],[35,4,35,6],[36,4,36,6],[37,4,37,6],[38,4,38,6],[39,4,39,6],[40,4,40,6],[41,4,41,6],[42,4,42,6],[43,4,43,6],[44,3,44,7],[44,14,52,14],[45,4,45,6],[46,4,46,6],[47,4,47,6],[48,4,48,6],[49,4,49,6],[50,4,50,6],[51,4,51,6],[52,4,52,6],[53,4,53,6],[54,4,54,6],[55,3,55,7],[55,14,58,14],[60,3,60,7],[60,14,62,14],[63,1,63,7],[64,14,65,14],[67,3,67,7],[67,14,69,14],[72,14,74,14],[77,1,77,7],[77,8,77,9],[79,1,79,10],[81,1,82,9],[83,1,83,9],[84,1,84,9],[87,1,88,9],[87,14,89,14]]}
["Estimated Budget – Annex 1",{"$nulls":8},{"$f":"'Key data'!C33","v":"00:00:00"},{"$nulls":4},"Instructions:\nThis is merely intended to provide guidance in filling out the ‘Financing budget’ tab. "]
[]
[null,"Description","Code","Quantity ","Unit (e.g. person, vehicle, room)","Quantity","Unit (e.g. months, days, courses)","Eligible for support up to  \nin EUR \n(price per unit) ","Total \nGIZ contribution\nin EUR (up to)","Own contributions/third-party financing\nin EUR (up to) ",{"$nulls":4},"General information: \nThis budget format is used as a basis for settlement. You may create additional files with more detailed information for your own internal use.\nAll items listed in the budget must be included in the project description to ensure that the project reference is clear. \nThe table contains formulas that must be retained.  \nPlease keep the two-decimal-place format. \nWe advise rounding up units to the nearest full unit. Costs are agreed at a value of ‘up to’. "]
[null,"Note: Blue fields to be filled in by the recipient",{"$nulls":6},"Note: calculated automatically",{"$nulls":5},"Notes on filling out the table"]
[1,"Staff - prime cost for employees of the Recipient (job title)\n(Note 1: Only staff from your organisations; the evidence for this budget line must be provided in the form of payslips or, in the case of partial financing, in the form of payslips and time sheets.\nNote 2: Only direct costs for staff (gross cost for the employer) may be settled. Add-ons such as staff overheads that are calculated pro-rata for staff are not eligible for support)",null,"",{"$nulls":4},{"$f":"SUM(I6:I10)","v":{"v":94000,"d":"94,000.00"}},"GIZ is unable to provide pro-rata financing for any of the budget lines (with the exception of staff costs (item 1) which can be covered on a percentage basis, or costs that fall under the cost category ‘Pro-rata local project costs’ (item 7)). \n\nCosts that are incurred as part of the implementation of the project but are not funded by GIZ are calculated separately - either as own contribution or, if applicable, as financial contribution of a third party.",{"$nulls":4},"The column ‘Eligible for support up to’ should always display the gross cost for the employer, which is laid down in the employment contract. For part-time positions, enter the percentage in column D. Please state the statutory ancillary personnel costs that apply for your country. As a general rule, social contributions are eligible for funding, as are payments that have been agreed in an employment contract or under a collective bargaining agreement (with the exception of bonus and profit-sharing payments). Any ancillary costs that do not fall under this category must be discussed and agreed, reviewed and noted in the budget line before the contract is prepared. Contracts for ‘mini-jobs’ or for students on temporary work are to be allocated to staff costs, even if no social contributions are incurred in this context.                                                                                                                                                                                   If funding is to be provided for several people on a pro-rata basis (e.g. three people working 75%), please increase the number of months as required and enter the number of people in the budget line description."]
[null,"Project manager",null,{"v":1,"d":"100%"},"people",20,"months",{"v":3000,"d":"3,000.00"},{"$f":"D6*F6*H6","v":{"v":60000,"d":"60,000.00"}}]
[null,"Financial manager ",null,{"v":0.5,"d":"50%"},"people",20,"months",{"v":2200,"d":"2,200.00"},{"$f":"D7*F7*H7","v":{"v":22000,"d":"22,000.00"}}]
[null,"Severance payments / statutory accruals ",null,{"v":1,"d":"100%"},"people",20,"months",{"v":600,"d":"600.00"},{"v":12000,"d":"12,000.00"}]
[{"$nulls":4},"people",null,"months",null,{"v":0,"d":"0.00"}]
[{"$nulls":4},"people",null,"months",null,{"v":0,"d":"0.00"}]
[2,"External services (type/content of service)\n",null,"",{"$nulls":4},{"$f":"SUM(I12:I21)","v":{"v":7000,"d":"7,000.00"}},{"$nulls":5},"Enter the role title; no contract details (e.g. working hours); only state the number of contracts and the planned value (the relevant guidelines governing contracts awards must be observed); one budget line should be used for each contract; all costs (such as training, business trips) incurred as part of service delivery under a service contract are displayed in one budget line.                                                                                                                                                                                                              Events: Services provided by the same provider should be displayed in one budget line. (e.g.: if a hotel provides both catering and the venue, these costs belong in a single budget line; if another hotel is booked for accommodation, then these costs belong in a separate line).\nAny items for which the recipient receives income when running the event cannot be financed under the contract (e.g. rental for rooms on own premises). Funding can only be provided for costs for which evidence can actually be provided."]
[null,"Moderation services",null,1,"Contract ",null,null,{"v":5000,"d":"5,000.00"},{"$f":"D12*H12","v":{"v":5000,"d":"5,000.00"}}]
[null,"Catering and room rental",null,1,"Contract ",null,null,{"v":2000,"d":"2,000.00"},{"$f":"D13*H13","v":{"v":2000,"d":"2,000.00"}}]
[null,"Solar technology expert",null,null,"Contract ",{"$nulls":3},{"v":0,"d":"0.00"}]
[null,"Expert for…",null,null,"Contract ",{"$nulls":3},{"v":0,"d":"0.00"}]
[null,"External workers (not in an employment relationship with recipient that is subject to social insurance contributions)",null,null,"Contract ",{"$nulls":3},{"v":0,"d":"0.00"}]
[null,"Consultancy assignments",null,null,"Contract ",{"$nulls":3},{"v":0,"d":"0.00"}]
[null,"External companies, e.g. for bus transport",null,null,"Contract ",{"$nulls":3},{"v":0,"d":"0.00"}]
[{"$nulls":4},"Contract ",{"$nulls":3},{"v":0,"d":"0.00"}]
[{"$nulls":4},"Contract ",{"$nulls":3},{"v":0,"d":"0.00"}]
[{"$nulls":4},"Contract ",{"$nulls":3},{"v":0,"d":"0.00"}]
[3,"Transportation/travel costs",null,"",{"$nulls":4},{"$f":"SUM(I23:I31)","v":{"v":4500,"d":"4,500.00"}},{"$nulls":5},"Travel costs usually include all types of transportation, accommodation, per-diem allowances and visa charges. List all other costs separately. Costs are settled based on invoices and/or the recipient’s travel expense guidelines and/or statutory provisions, such as the Federal Travel Expenses Act (BRKG). You should not break down the costs for different into groups of people.\n\nPlease do not enter the number of flights - any deviations must be covered by a contract supplement, and the number of flights will be checked should an audit be carried out."]
[null,"International flights",null,1,"Unit",null,null,{"v":4000,"d":"4,000.00"},{"$f":"D23*H23","v":{"v":4000,"d":"4,000.00"}}]
[null,"Domestic flights",null,1,"Unit",null,null,{"v":500,"d":"500.00"},{"$f":"D24*H24","v":{"v":500,"d":"500.00"}}]
[null,"International travel costs (per-diem/overnight accommodation allowance, means of transport, visa, required vaccinations)",{"$nulls":6},{"v":0,"d":"0.00"}]
[null,"Domestic travel costs (per-diem/overnight accommodation allowance, means of transport)",{"$nulls":6},{"v":0,"d":"0.00"}]
[null,"Transportation costs for goods",{"$nulls":6},{"v":0,"d":"0.00"}]
[null,"Travel costs for workshop participants",{"$nulls":6},{"v":0,"d":"0.00"}]
[{"$nulls":8},{"v":0,"d":"0.00"}]
[{"$nulls":8},{"$f":"D30*F30*H30","v":{"v":0,"d":"0.00"}}]
{"$rows_left_out":58}